Reaction Details
TargetCoagulation factor X
LigandBDBM13665
Substrate/CompetitorBDBM12500
Meas. Tech.Factor Xa Inhibition Assay
Ki 41±n/a nM
Citation Matter, HWill, DWNazare, MSchreuder, HLaux, VWehner, V Structural requirements for factor Xa inhibition by 3-oxybenzamides with neutral P1 substituents: combining X-ray crystallography, 3D-QSAR, and tailored scoring functions. J Med Chem48:3290-312 (2005) 
 
Coagulation factor X
Name:Coagulation factor X
Type:Enzyme
Mol. Mass.:54726.60
Organism:Homo sapiens (Human)
Description:n/a
Residue:488
BDBM13665
BDBM12500
NameBDBM13665
Synonyms:3-Oxybenzamide 51 | 3-[2-(4-chlorophenyl)ethoxy]-4-methoxy-N-{[1-(pyridin-4-yl)piperidin-4-yl]methyl}benzamide
TypeSmall organic molecule
Emp. Form.C27H30ClN3O3
Mol. Mass.479.998
SMILESCOc1ccc(cc1OCCc1ccc(Cl)cc1)C(=O)NCC1CCN(CC1)c1ccncc1