Reaction Details
TargetCoagulation factor X
LigandBDBM13666
Substrate/CompetitorBDBM12500
Meas. Tech.Factor Xa Inhibition Assay
Ki 54±n/a nM
Citation Matter, HWill, DWNazare, MSchreuder, HLaux, VWehner, V Structural requirements for factor Xa inhibition by 3-oxybenzamides with neutral P1 substituents: combining X-ray crystallography, 3D-QSAR, and tailored scoring functions. J Med Chem48:3290-312 (2005) 
 
Coagulation factor X
Name:Coagulation factor X
Type:Enzyme
Mol. Mass.:54726.60
Organism:Homo sapiens (Human)
Description:n/a
Residue:488
BDBM13666
BDBM12500
NameBDBM13666
Synonyms:3-Oxybenzamide 52 | 3-[2-(5-chloropyridin-2-yl)ethoxy]-4-methoxy-N-{[1-(pyridin-4-yl)piperidin-4-yl]methyl}benzamide
TypeSmall organic molecule
Emp. Form.C26H29ClN4O3
Mol. Mass.480.986
SMILESCOc1ccc(cc1OCCc1ccc(Cl)cn1)C(=O)NCC1CCN(CC1)c1ccncc1