Reaction Details
TargetCoagulation factor X
LigandBDBM13671
Substrate/CompetitorBDBM12500
Meas. Tech.Factor Xa Inhibition Assay
Ki 153±n/a nM
Citation Matter, HWill, DWNazare, MSchreuder, HLaux, VWehner, V Structural requirements for factor Xa inhibition by 3-oxybenzamides with neutral P1 substituents: combining X-ray crystallography, 3D-QSAR, and tailored scoring functions. J Med Chem48:3290-312 (2005) 
 
Coagulation factor X
Name:Coagulation factor X
Type:Enzyme
Mol. Mass.:54726.60
Organism:Homo sapiens (Human)
Description:n/a
Residue:488
BDBM13671
BDBM12500
NameBDBM13671
Synonyms:(2S)-5-carbamimidamido-2-({3-[2-(2,4-dichlorophenyl)ethoxy]-4-methoxyphenyl}formamido)-N,N-diethylpentanamide | 3-Oxybenzamide 57
TypeSmall organic molecule
Emp. Form.C26H35Cl2N5O4
Mol. Mass.552.493
SMILES[#6]-[#6]-[#7](-[#6]-[#6])-[#6](=O)-[#6@H](-[#6]-[#6]-[#6]\[#7]=[#6](\[#7])-[#7])-[#7]-[#6](=O)-c1ccc(-[#8]-[#6])c(-[#8]-[#6]-[#6]-c2ccc(Cl)cc2Cl)c1