Reaction Details
TargetCoagulation factor X
LigandBDBM13672
Substrate/CompetitorBDBM12500
Meas. Tech.Factor Xa Inhibition Assay
Ki 189±n/a nM
Citation Matter, HWill, DWNazare, MSchreuder, HLaux, VWehner, V Structural requirements for factor Xa inhibition by 3-oxybenzamides with neutral P1 substituents: combining X-ray crystallography, 3D-QSAR, and tailored scoring functions. J Med Chem48:3290-312 (2005) 
 
Coagulation factor X
Name:Coagulation factor X
Type:Enzyme
Mol. Mass.:54726.60
Organism:Homo sapiens (Human)
Description:n/a
Residue:488
BDBM13672
BDBM12500
NameBDBM13672
Synonyms:3-Oxybenzamide 58 | N-[(1-carbamimidoylpiperidin-4-yl)methyl]-3-[2-(2,4-dichlorophenyl)ethoxy]-4-methoxybenzamide
TypeSmall organic molecule
Emp. Form.C23H28Cl2N4O3
Mol. Mass.479.399
SMILESCOc1ccc(cc1OCCc1ccc(Cl)cc1Cl)C(=O)NCC1CCN(CC1)C(N)=N