Reaction Details
TargetCoagulation factor X
LigandBDBM13689
Substrate/CompetitorBDBM12500
Meas. Tech.Factor Xa Inhibition Assay
Ki 140±n/a nM
Citation Matter, HWill, DWNazare, MSchreuder, HLaux, VWehner, V Structural requirements for factor Xa inhibition by 3-oxybenzamides with neutral P1 substituents: combining X-ray crystallography, 3D-QSAR, and tailored scoring functions. J Med Chem48:3290-312 (2005) 
 
Coagulation factor X
Name:Coagulation factor X
Type:Enzyme
Mol. Mass.:54726.60
Organism:Homo sapiens (Human)
Description:n/a
Residue:488
BDBM13689
BDBM12500
NameBDBM13689
Synonyms:3-Oxybenzamide 75 | 3-[2-(2,4-dichlorophenyl)ethoxy]-N-[(1-ethanimidoylpiperidin-4-yl)methyl]-4-methylbenzamide
TypeSmall organic molecule
Emp. Form.C24H29Cl2N3O2
Mol. Mass.462.412
SMILESCC(=N)N1CCC(CNC(=O)c2ccc(C)c(OCCc3ccc(Cl)cc3Cl)c2)CC1