Reaction Details
TargetCoagulation factor X
LigandBDBM13706
Substrate/CompetitorBDBM12500
Meas. Tech.Factor Xa Inhibition Assay
Ki 167±n/a nM
Citation Matter, HWill, DWNazare, MSchreuder, HLaux, VWehner, V Structural requirements for factor Xa inhibition by 3-oxybenzamides with neutral P1 substituents: combining X-ray crystallography, 3D-QSAR, and tailored scoring functions. J Med Chem48:3290-312 (2005) 
 
Coagulation factor X
Name:Coagulation factor X
Type:Enzyme
Mol. Mass.:54726.60
Organism:Homo sapiens (Human)
Description:n/a
Residue:488
BDBM13706
BDBM12500
NameBDBM13706
Synonyms:1-({3-[2-(2,4-dichlorophenyl)ethoxy]-4,5-dimethoxyphenyl}carbonyl)-4-(pyridin-4-ylmethyl)piperazine | 3-Oxybenzamide 92
TypeSmall organic molecule
Emp. Form.C27H29Cl2N3O4
Mol. Mass.530.443
SMILESCOc1cc(cc(OCCc2ccc(Cl)cc2Cl)c1OC)C(=O)N1CCN(Cc2ccncc2)CC1