Reaction Details
TargetCoagulation factor X
LigandBDBM13707
Substrate/CompetitorBDBM12500
Meas. Tech.Factor Xa Inhibition Assay
Ki 306±n/a nM
Citation Matter, HWill, DWNazare, MSchreuder, HLaux, VWehner, V Structural requirements for factor Xa inhibition by 3-oxybenzamides with neutral P1 substituents: combining X-ray crystallography, 3D-QSAR, and tailored scoring functions. J Med Chem48:3290-312 (2005) 
 
Coagulation factor X
Name:Coagulation factor X
Type:Enzyme
Mol. Mass.:54726.60
Organism:Homo sapiens (Human)
Description:n/a
Residue:488
BDBM13707
BDBM12500
NameBDBM13707
Synonyms:1-({3-[2-(2,4-dichlorophenyl)ethoxy]-4-ethoxyphenyl}carbonyl)-4-(pyridin-4-ylmethyl)piperazine | 3-Oxybenzamide 93
TypeSmall organic molecule
Emp. Form.C27H29Cl2N3O3
Mol. Mass.514.443
SMILESCCOc1ccc(cc1OCCc1ccc(Cl)cc1Cl)C(=O)N1CCN(Cc2ccncc2)CC1