Reaction Details
TargetDipeptidyl peptidase 1
LigandBDBM201017
Substrate/Competitorn/a
Meas. Tech.Inhibition of Human DPPI (Cathepsin C)
Temperature298.15±n/a K
IC50 0.200±0 nM
Commentsextracted
Citation Vintonyak, VGrauert, MGrundl, MPautsch, A Substituted spirocycles US Patent US9540373 Publication Date 1/10/2017
 
Dipeptidyl peptidase 1
Name:Dipeptidyl peptidase 1
Type:Enzyme
Mol. Mass.:51857.28
Organism:Homo sapiens (Human)
Description:P53634
Residue:463
BDBM201017
NameBDBM201017
Synonyms:US9540373, 6 USRE47636, Example 6
TypeSmall organic molecule
Emp. Form.C29H32FN5O2
Mol. Mass.501.5951
SMILESCN1CCC2(CC1)C(=O)Nc1ccc(cc21)-c1ccc(C[C@H](NC(=O)[C@H]2N[C@@H]3CC[C@H]2C3)C#N)c(F)c1