Reaction Details
TargetFlap endonuclease 1
LigandBDBM168670
Substrate/Competitorn/a
Meas. Tech.Binding Assay
Ki 1.000±n/a nM
Citation Bacani, GMEccles, WFitzgerald, AEGoldberg, SDHack, MDHawryluk, NAJones, WMKeith, JMKrawczuk, PLebsack, ADLee-Dutra, ALiu, JMcClure, KJMeduna, SPPippel, DJRosen, MDSales, ZS Flap modulators US Patent US9745328 Publication Date 8/29/2017
 
Flap endonuclease 1
Name:Flap endonuclease 1
Type:PROTEIN
Mol. Mass.:42602.57
Organism:Homo sapiens (Human)
Description:ChEMBL_1517026
Residue:380
BDBM168670
NameBDBM168670
Synonyms:US9079866, 47 US9884878, Compound 47
TypeSmall organic molecule
Emp. Form.C20H21FN4O2S
Mol. Mass.400.47
SMILESCCN(CC)S(=O)(=O)c1ccccc1-c1ccc(c(F)c1)-c1cnc(N)cn1