Reaction Details
TargetFlap endonuclease 1
LigandBDBM283230
Substrate/Competitorn/a
Meas. Tech.Binding Assay
Ki<1±n/a nM
CommentsZero 01/04/2022
Citation Bacani, GMEccles, WFitzgerald, AEGoldberg, SDHack, MDHawryluk, NAJones, WMKeith, JMKrawczuk, PLebsack, ADLee-Dutra, ALiu, JMcClure, KJMeduna, SPPippel, DJRosen, MDSales, ZS Flap modulators US Patent US9745328 Publication Date 8/29/2017
 
Flap endonuclease 1
Name:Flap endonuclease 1
Type:PROTEIN
Mol. Mass.:42602.57
Organism:Homo sapiens (Human)
Description:ChEMBL_1517026
Residue:380
BDBM283230
NameBDBM283230
Synonyms:4'-(5-Aminopyrazin-2-yl)-3'-fluoro-N-(3- hydroxy-2,2-dimethylpropyl)biphenyl-2- sulfonamide US9884878, Compound 103
TypeSmall organic molecule
Emp. Form.C21H23FN4O3S
Mol. Mass.430.496
SMILESCC(C)(CO)CNS(=O)(=O)c1ccccc1-c1ccc(c(F)c1)-c1cnc(N)cn1