Reaction Details
TargetFlap endonuclease 1
LigandBDBM60470
Substrate/Competitorn/a
Meas. Tech.Binding Assay
Ki 2.00±n/a nM
Citation Bacani, GMEccles, WFitzgerald, AEGoldberg, SDHack, MDHawryluk, NAJones, WMKeith, JMKrawczuk, PLebsack, ADLee-Dutra, ALiu, JMcClure, KJMeduna, SPPippel, DJRosen, MDSales, ZS Flap modulators US Patent US9745328 Publication Date 8/29/2017
 
Flap endonuclease 1
Name:Flap endonuclease 1
Type:PROTEIN
Mol. Mass.:42602.57
Organism:Homo sapiens (Human)
Description:ChEMBL_1517026
Residue:380
BDBM60470
NameBDBM60470
Synonyms:BDBM168646 US9745328, Compound 127 | US9884878, Compound 127
Typen/a
Emp. Form.C19H16F4N4O2S
Mol. Mass.440.415
SMILESC[C@@H](NS(=O)(=O)c1ccccc1-c1ccc(c(F)c1)-c1cnc(N)cn1)C(F)(F)F