Reaction Details
TargetFlap endonuclease 1
LigandBDBM283262
Substrate/Competitorn/a
Meas. Tech.Binding Assay
Ki<1±n/a nM
CommentsZero 01/04/2022
Citation Bacani, GMEccles, WFitzgerald, AEGoldberg, SDHack, MDHawryluk, NAJones, WMKeith, JMKrawczuk, PLebsack, ADLee-Dutra, ALiu, JMcClure, KJMeduna, SPPippel, DJRosen, MDSales, ZS Flap modulators US Patent US9745328 Publication Date 8/29/2017
 
Flap endonuclease 1
Name:Flap endonuclease 1
Type:PROTEIN
Mol. Mass.:42602.57
Organism:Homo sapiens (Human)
Description:ChEMBL_1517026
Residue:380
BDBM283262
NameBDBM283262
Synonyms:(S)-(1-{[4'-(5-Aminopyrazin-2-yl)-3'- fluorobiphenyl-2-yl]sulfonyl}-2,3-dihydro-1H- indol-2-yl)methanol US9884878, Compound 135
TypeSmall organic molecule
Emp. Form.C25H21FN4O3S
Mol. Mass.476.523
SMILESNc1cnc(cn1)-c1ccc(cc1F)-c1ccccc1S(=O)(=O)N1[C@H](CO)Cc2ccccc12