Reaction Details
TargetFlap endonuclease 1
LigandBDBM283288
Substrate/Competitorn/a
Meas. Tech.Binding Assay
Ki<1±n/a nM
CommentsZero 01/04/2022
Citation Bacani, GMEccles, WFitzgerald, AEGoldberg, SDHack, MDHawryluk, NAJones, WMKeith, JMKrawczuk, PLebsack, ADLee-Dutra, ALiu, JMcClure, KJMeduna, SPPippel, DJRosen, MDSales, ZS Flap modulators US Patent US9745328 Publication Date 8/29/2017
 
Flap endonuclease 1
Name:Flap endonuclease 1
Type:PROTEIN
Mol. Mass.:42602.57
Organism:Homo sapiens (Human)
Description:ChEMBL_1517026
Residue:380
BDBM283288
NameBDBM283288
Synonyms:4'-(5-aminopyrazin-2-yl)-3'-fluoro-N-((1R,2S)- 2-hydroxy-2,3-dihydro-1H-inden-1-yl)-[1,1'- biphenyl]-2-sulfonamide US9884878, Compound 161
TypeSmall organic molecule
Emp. Form.C25H21FN4O3S
Mol. Mass.476.523
SMILESNc1cnc(cn1)-c1ccc(cc1F)-c1ccccc1S(=O)(=O)N[C@H]1[C@@H](O)Cc2ccccc12