Reaction Details
TargetFlap endonuclease 1
LigandBDBM283303
Substrate/Competitorn/a
Meas. Tech.Binding Assay
Ki<1±n/a nM
CommentsZero 01/04/2022
Citation Bacani, GMEccles, WFitzgerald, AEGoldberg, SDHack, MDHawryluk, NAJones, WMKeith, JMKrawczuk, PLebsack, ADLee-Dutra, ALiu, JMcClure, KJMeduna, SPPippel, DJRosen, MDSales, ZS Flap modulators US Patent US9745328 Publication Date 8/29/2017
 
Flap endonuclease 1
Name:Flap endonuclease 1
Type:PROTEIN
Mol. Mass.:42602.57
Organism:Homo sapiens (Human)
Description:ChEMBL_1517026
Residue:380
BDBM283303
NameBDBM283303
Synonyms:5-{3-Fluoro-2'-[(4-pyrazin-2-ylpiperazin-1- yl)sulfonyl]biphenyl-4-yl}pyrazin-2-amine US9884878, Compound 176
TypeSmall organic molecule
Emp. Form.C24H22FN7O2S
Mol. Mass.491.541
SMILESNc1cnc(cn1)-c1ccc(cc1F)-c1ccccc1S(=O)(=O)N1CCN(CC1)c1cnccn1