Reaction Details
TargetFlap endonuclease 1
LigandBDBM283508
Substrate/Competitorn/a
Meas. Tech.Binding Assay
Ki<1±n/a nM
CommentsZero 01/04/2022
Citation Bacani, GMEccles, WFitzgerald, AEGoldberg, SDHack, MDHawryluk, NAJones, WMKeith, JMKrawczuk, PLebsack, ADLee-Dutra, ALiu, JMcClure, KJMeduna, SPPippel, DJRosen, MDSales, ZS Flap modulators US Patent US9745328 Publication Date 8/29/2017
 
Flap endonuclease 1
Name:Flap endonuclease 1
Type:PROTEIN
Mol. Mass.:42602.57
Organism:Homo sapiens (Human)
Description:ChEMBL_1517026
Residue:380
BDBM283508
NameBDBM283508
Synonyms:2-{2'-[(1,1-Dioxidothiomorpholin-4-yl)sulfonyl]- 3-fluorobiphenyl-4-yl}-5H-pyrrolo[2,3- b]pyrazine US9884878, Compound 382
TypeSmall organic molecule
Emp. Form.C22H19FN4O4S2
Mol. Mass.486.539
SMILESFc1cc(ccc1-c1cnc2[nH]ccc2n1)-c1ccccc1S(=O)(=O)N1CCS(=O)(=O)CC1