Reaction Details
TargetFlap endonuclease 1
LigandBDBM169405
Substrate/Competitorn/a
Meas. Tech.Binding Assay
Ki 0.600±n/a nM
Citation Bacani, GMEccles, WFitzgerald, AEGoldberg, SDHack, MDHawryluk, NAJones, WMKeith, JMKrawczuk, PLebsack, ADLee-Dutra, ALiu, JMcClure, KJMeduna, SPPippel, DJRosen, MDSales, ZS Flap modulators US Patent US9745328 Publication Date 8/29/2017
 
Flap endonuclease 1
Name:Flap endonuclease 1
Type:PROTEIN
Mol. Mass.:42602.57
Organism:Homo sapiens (Human)
Description:ChEMBL_1517026
Residue:380
BDBM169405
NameBDBM169405
Synonyms:US9079866, 810 US9884878, Compound 810
TypeSmall organic molecule
Emp. Form.C20H19FN4O2S
Mol. Mass.398.454
SMILESNc1cnc(cn1)-c1ccc(cc1F)-c1cccnc1S(=O)(=O)C1CCCC1