Reaction Details
TargetFlap endonuclease 1
LigandBDBM337621
Substrate/Competitorn/a
Meas. Tech.Binding Assay
Ki 0.300±n/a nM
Citation Bacani, GMEccles, WFitzgerald, AEGoldberg, SDHack, MDHawryluk, NAJones, WMKeith, JMKrawczuk, PLebsack, ADLee-Dutra, ALiu, JMcClure, KJMeduna, SPPippel, DJRosen, MDSales, ZS Flap modulators US Patent US9745328 Publication Date 8/29/2017
 
Flap endonuclease 1
Name:Flap endonuclease 1
Type:PROTEIN
Mol. Mass.:42602.57
Organism:Homo sapiens (Human)
Description:ChEMBL_1517026
Residue:380
BDBM337621
NameBDBM337621
Synonyms:5-{2-Fluoro-4-[2-tetrahydro-2H- pyran-4-ylsulfonyl)-6- (trifluoromethyl)pyridin-3- yl]phenyl}pyrazin-2-amine | US9745328, Compound 906
TypeSmall organic molecule
Emp. Form.C21H18F4N4O3S
Mol. Mass.482.451
SMILESNc1cnc(cn1)-c1ccc(cc1F)-c1ccc(nc1S(=O)(=O)C1CCOCC1)C(F)(F)F