Reaction Details
TargetHistone deacetylase 1
LigandBDBM337645
Substrate/Competitorn/a
Meas. Tech.Inhibition Assay
IC50 265±59 nM
Citation Sotomayor, EMBergman, JAKozikowski, APVillagra, AVWoan, KV Selective histone deactylase 6 inhibitors US Patent US9751832 Publication Date 9/5/2017
 
Histone deacetylase 1
Name:Histone deacetylase 1
Type:Enzyme
Mol. Mass.:55090.27
Organism:Homo sapiens (Human)
Description:Q13547
Residue:482
BDBM337645
NameBDBM337645
Synonyms:US10227295, Compound 1 | US9751832, Compound 1
TypeSmall organic molecule
Emp. Form.C16H17N3O3
Mol. Mass.299.3245
SMILESCOc1ccccc1NC(=O)NCc1ccc(cc1)C(N)=O