Reaction Details
TargetHistone deacetylase 6
LigandBDBM50398726
Substrate/Competitorn/a
Meas. Tech.Inhibition Assay
IC50 458±64 nM
Citation Sotomayor, EMBergman, JAKozikowski, APVillagra, AVWoan, KV Selective histone deactylase 6 inhibitors US Patent US9751832 Publication Date 9/5/2017
 
Histone deacetylase 6
Name:Histone deacetylase 6
Type:Chromatin regulator; hydrolase; repressor
Mol. Mass.:131381.51
Organism:Homo sapiens (Human)
Description:Q9UBN7
Residue:1215
BDBM50398726
NameBDBM50398726
Synonyms:CHEMBL2179248 US9409858, 5a US9956192, Compound 5a
TypeSmall organic molecule
Emp. Form.C21H28N4O4
Mol. Mass.400.4714
SMILESCOc1ccccc1NC(=O)N(CCCN(C)C)Cc1ccc(cc1)C(=O)NO