Reaction Details
TargetHistone deacetylase 1
LigandBDBM50398720
Substrate/Competitorn/a
Meas. Tech.Inhibition Assay
IC50 3120±640 nM
Citation Sotomayor, EMBergman, JAKozikowski, APVillagra, AVWoan, KV Selective histone deactylase 6 inhibitors US Patent US9751832 Publication Date 9/5/2017
 
Histone deacetylase 1
Name:Histone deacetylase 1
Type:Enzyme
Mol. Mass.:55090.27
Organism:Homo sapiens (Human)
Description:Q13547
Residue:482
BDBM50398720
NameBDBM50398720
Synonyms:CHEMBL2179619 US9409858, 5h US9956192, Compound 5h
TypeSmall organic molecule
Emp. Form.C23H23N3O3
Mol. Mass.389.447
SMILESONC(=O)c1ccc(CN(CCc2ccccc2)C(=O)Nc2ccccc2)cc1