Reaction Details
TargetHistone deacetylase 6
LigandBDBM50398719
Substrate/Competitorn/a
Meas. Tech.Inhibition Assay
IC50 25.2±2.5 nM
Citation Sotomayor, EMBergman, JAKozikowski, APVillagra, AVWoan, KV Selective histone deactylase 6 inhibitors US Patent US9751832 Publication Date 9/5/2017
 
Histone deacetylase 6
Name:Histone deacetylase 6
Type:Chromatin regulator; hydrolase; repressor
Mol. Mass.:131381.51
Organism:Homo sapiens (Human)
Description:Q9UBN7
Residue:1215
BDBM50398719
NameBDBM50398719
Synonyms:CHEMBL2179244 US9409858, 8a US9956192, Compound 8a
TypeSmall organic molecule
Emp. Form.C19H23N3O3
Mol. Mass.341.4042
SMILESCCCCN(C(=O)NCc1ccc(cc1)C(=O)NO)c1ccccc1