Reaction Details
TargetHistone deacetylase 1
LigandBDBM337657
Substrate/Competitorn/a
Meas. Tech.Inhibition Assay
IC50 1060±n/a nM
Citation Sotomayor, EMBergman, JAKozikowski, APVillagra, AVWoan, KV Selective histone deactylase 6 inhibitors US Patent US9751832 Publication Date 9/5/2017
 
Histone deacetylase 1
Name:Histone deacetylase 1
Type:Enzyme
Mol. Mass.:55090.27
Organism:Homo sapiens (Human)
Description:Q13547
Residue:482
BDBM337657
NameBDBM337657
Synonyms:US10227295, Compound 9a US9956192, Compound 9a
TypeSmall organic molecule
Emp. Form.C16H17N3O4
Mol. Mass.315.3239
SMILESOCc1ccc(NC(=O)NCc2ccc(cc2)C(=O)NO)cc1