Reaction Details
TargetDipeptidyl peptidase 4
LigandBDBM13795
Substrate/CompetitorBDBM11057
Meas. Tech.DPP Inhibition Assay
pH7.5±n/a
Temperature295.15±n/a K
Ki 10±n/a nM
Citation Kurukulasuriya, RRohde, JJSzczepankiewicz, BGBasha, FLai, CJae, HSWinn, MStewart, KDLongenecker, KLLubben, TWBallaron, SJSham, HLvon Geldern, TW Xanthine mimetics as potent dipeptidyl peptidase IV inhibitors. Bioorg Med Chem Lett16:6226-30 (2006) 
 
Dipeptidyl peptidase 4
Name:Dipeptidyl peptidase 4
Type:Enzyme
Mol. Mass.:88271.01
Organism:Homo sapiens (Human)
Description:P27487
Residue:766
BDBM13795
BDBM11057
NameBDBM13795
Synonyms:2-(3-aminopiperidin-1-yl)-5-methyl-1-{[2-(trifluoromethyl)phenyl]methyl}-1H,4H,5H,6H-pyrrolo[3,4-d]imidazole-4,6-dione | Xanthine mimetic compound 10
TypeSmall organic molecule
Emp. Form.C19H20F3N5O2
Mol. Mass.407.3896
SMILESCN1C(=O)c2nc(N3CCCC(N)C3)n(Cc3ccccc3C(F)(F)F)c2C1=O