Reaction Details
TargetDipeptidyl peptidase 4
LigandBDBM13798
Substrate/CompetitorBDBM11057
Meas. Tech.DPP Inhibition Assay
pH7.5±n/a
Temperature295.15±n/a K
Ki 11±n/a nM
Citation Kurukulasuriya, RRohde, JJSzczepankiewicz, BGBasha, FLai, CJae, HSWinn, MStewart, KDLongenecker, KLLubben, TWBallaron, SJSham, HLvon Geldern, TW Xanthine mimetics as potent dipeptidyl peptidase IV inhibitors. Bioorg Med Chem Lett16:6226-30 (2006) 
 
Dipeptidyl peptidase 4
Name:Dipeptidyl peptidase 4
Type:Enzyme
Mol. Mass.:88271.01
Organism:Homo sapiens (Human)
Description:P27487
Residue:766
BDBM13798
BDBM11057
NameBDBM13798
Synonyms:2-(3-{[2-(3-aminopiperidin-1-yl)-6-methyl-7-oxo-1H,6H,7H-imidazo[4,5-d]pyridazin-1-yl]methyl}phenyl)acetonitrile | Xanthine mimetic compound 13
TypeSmall organic molecule
Emp. Form.C20H23N7O
Mol. Mass.377.4429
SMILESCn1ncc2nc(N3CCCC(N)C3)n(Cc3cccc(CC#N)c3)c2c1=O