Reaction Details
TargetDipeptidyl peptidase 4
LigandBDBM13802
Substrate/CompetitorBDBM11057
Meas. Tech.DPP Inhibition Assay
pH7.5±n/a
Temperature295.15±n/a K
Ki 300±n/a nM
Citation Kurukulasuriya, RRohde, JJSzczepankiewicz, BGBasha, FLai, CJae, HSWinn, MStewart, KDLongenecker, KLLubben, TWBallaron, SJSham, HLvon Geldern, TW Xanthine mimetics as potent dipeptidyl peptidase IV inhibitors. Bioorg Med Chem Lett16:6226-30 (2006) 
 
Dipeptidyl peptidase 4
Name:Dipeptidyl peptidase 4
Type:Enzyme
Mol. Mass.:88271.01
Organism:Homo sapiens (Human)
Description:P27487
Residue:766
BDBM13802
BDBM11057
NameBDBM13802
Synonyms:2-(3-aminopiperidin-1-yl)-3-benzyl-4-oxido-3H-imidazo[4,5-b]pyridin-4-ium | Xanthine mimetic compound 17
TypeSmall organic molecule
Emp. Form.C18H21N5O
Mol. Mass.323.3922
SMILESNC1CCCN(C1)c1nc2ccc[n+]([O-])c2n1Cc1ccccc1