Reaction Details
TargetDipeptidyl peptidase 4
LigandBDBM13804
Substrate/CompetitorBDBM11057
Meas. Tech.DPP Inhibition Assay
pH7.5±n/a
Temperature295.15±n/a K
Ki 450±n/a nM
Citation Kurukulasuriya, RRohde, JJSzczepankiewicz, BGBasha, FLai, CJae, HSWinn, MStewart, KDLongenecker, KLLubben, TWBallaron, SJSham, HLvon Geldern, TW Xanthine mimetics as potent dipeptidyl peptidase IV inhibitors. Bioorg Med Chem Lett16:6226-30 (2006) 
 
Dipeptidyl peptidase 4
Name:Dipeptidyl peptidase 4
Type:Enzyme
Mol. Mass.:88271.01
Organism:Homo sapiens (Human)
Description:P27487
Residue:766
BDBM13804
BDBM11057
NameBDBM13804
Synonyms:2-(3-aminopiperidin-1-yl)-1-[(2-cyanophenyl)methyl]-4-N,5-N-dimethyl-1H-imidazole-4,5-dicarboxamide | Xanthine mimetic compound 19
TypeSmall organic molecule
Emp. Form.C20H25N7O2
Mol. Mass.395.4582
SMILESCNC(=O)c1nc(N2CCCC(N)C2)n(Cc2ccccc2C#N)c1C(=O)NC