Reaction Details
TargetDipeptidyl peptidase 8
LigandBDBM13793
Substrate/CompetitorBDBM11057
Meas. Tech.DPP Inhibition Assay
pH7.5±n/a
Temperature295.15±n/a K
Ki>3000±n/a nM
Citation Kurukulasuriya, RRohde, JJSzczepankiewicz, BGBasha, FLai, CJae, HSWinn, MStewart, KDLongenecker, KLLubben, TWBallaron, SJSham, HLvon Geldern, TW Xanthine mimetics as potent dipeptidyl peptidase IV inhibitors. Bioorg Med Chem Lett16:6226-30 (2006) 
 
Dipeptidyl peptidase 8
Name:Dipeptidyl peptidase 8
Type:Enzyme
Mol. Mass.:103342.62
Organism:Homo sapiens (Human)
Description:Q6V1X1
Residue:898
BDBM13793
BDBM11057
NameBDBM13793
Synonyms:2-{[2-(3-aminopiperidin-1-yl)-6-methyl-7-oxo-1H,6H,7H-imidazo[4,5-d]pyridazin-1-yl]methyl}benzonitrile | Xanthine mimetic compound 8
TypeSmall organic molecule
Emp. Form.C19H21N7O
Mol. Mass.363.4163
SMILESCn1ncc2nc(N3CCCC(N)C3)n(Cc3ccccc3C#N)c2c1=O