Reaction Details
TargetDipeptidyl peptidase 8
LigandBDBM13800
Substrate/CompetitorBDBM11057
Meas. Tech.DPP Inhibition Assay
pH7.5±n/a
Temperature295.15±n/a K
Ki>30000±n/a nM
Citation Kurukulasuriya, RRohde, JJSzczepankiewicz, BGBasha, FLai, CJae, HSWinn, MStewart, KDLongenecker, KLLubben, TWBallaron, SJSham, HLvon Geldern, TW Xanthine mimetics as potent dipeptidyl peptidase IV inhibitors. Bioorg Med Chem Lett16:6226-30 (2006) 
 
Dipeptidyl peptidase 8
Name:Dipeptidyl peptidase 8
Type:Enzyme
Mol. Mass.:103342.62
Organism:Homo sapiens (Human)
Description:Q6V1X1
Residue:898
BDBM13800
BDBM11057
NameBDBM13800
Synonyms:2-(3-aminopiperidin-1-yl)-1-{[2-(trifluoromethyl)phenyl]methyl}-1H,4H,9H-naphtho[2,3-d]imidazole-4,9-dione | Xanthine mimetic compound 15
TypeSmall organic molecule
Emp. Form.C24H21F3N4O2
Mol. Mass.454.4443
SMILESNC1CCCN(C1)c1nc2c(C(=O)c3ccccc3C2=O)n1Cc1ccccc1C(F)(F)F