Reaction Details
TargetTyrosine-protein kinase JAK1
LigandBDBM202320
Substrate/Competitorn/a
Meas. Tech.JAK1 Kinase Assay
pH7.3±n/a
Temperature298.15±n/a K
IC50 3.00±n/a nM
Commentsextracted
Citation Zhang, XDong, QLiu, BZhu, YLi, XLan, J Pyrrole six-membered heteroaryl ring derivative, preparation method thereof, and medicinal uses thereof US Patent US9527851 Publication Date 12/27/2016
 
Tyrosine-protein kinase JAK1
Name:Tyrosine-protein kinase JAK1
Type:Protein
Mol. Mass.:133293.73
Organism:Homo sapiens (Human)
Description:P23458
Residue:1154
BDBM202320
NameBDBM202320
Synonyms:1-((4as,7ar)-6-(methyl(7h-pyrrolo[2,3-d]pyrimidin-4-yl)amino)hexahydro-1h-cyclopenta[c]pyridin-2(3h,4h,4ah,5h,6h,7h,7ah)-yl)ethanone | US9527851, example 35
TypeSmall organic molecule
Emp. Form.C21H32N2O2
Mol. Mass.344.491
SMILESCN(Cc1ccccc1)C1C[C@H]2CCN(C[C@H]2C1)C(=O)OC(C)(C)C