Reaction Details
TargetTyrosine-protein kinase JAK1
LigandBDBM202338
Substrate/Competitorn/a
Meas. Tech.JAK1 Kinase Assay
pH7.3±n/a
Temperature298.15±n/a K
IC50 0.50±n/a nM
Commentsextracted
Citation Zhang, XDong, QLiu, BZhu, YLi, XLan, J Pyrrole six-membered heteroaryl ring derivative, preparation method thereof, and medicinal uses thereof US Patent US9527851 Publication Date 12/27/2016
 
Tyrosine-protein kinase JAK1
Name:Tyrosine-protein kinase JAK1
Type:Protein
Mol. Mass.:133293.73
Organism:Homo sapiens (Human)
Description:P23458
Residue:1154
BDBM202338
NameBDBM202338
Synonyms:(3ar,5s,6as)-n-(3-(hydroxymethyl)-1,2,4-thiadiazol-5-yl)-5-(methyl(7h-pyrrolo[2,3-d]pyrimidin-4-yl)amino)hexahydrocyclopenta[c]pyrrole-2(1h)-carboxamide | US9527851, example 50
TypeSmall organic molecule
Emp. Form.C19H22N8O3S
Mol. Mass.442.495
SMILESCOC(=O)c1nsc(NC(=O)N2C[C@@H]3CC(C[C@@H]3C2)N(C)c2ncnc3[nH]ccc23)n1