Reaction Details
TargetTyrosine-protein kinase JAK1
LigandBDBM260489
Substrate/Competitorn/a
Meas. Tech.JAK1 Kinase Assay
pH7.3±n/a
Temperature298.15±n/a K
IC50 4.00±n/a nM
Commentsextracted
Citation Zhang, XDong, QLiu, BZhu, YLi, XLan, J Pyrrole six-membered heteroaryl ring derivative, preparation method thereof, and medicinal uses thereof US Patent US9527851 Publication Date 12/27/2016
 
Tyrosine-protein kinase JAK1
Name:Tyrosine-protein kinase JAK1
Type:Protein
Mol. Mass.:133293.73
Organism:Homo sapiens (Human)
Description:P23458
Residue:1154
BDBM260489
NameBDBM260489
Synonyms:US10428074, Example 74 US9527851, example 74
TypeSmall organic molecule
Emp. Form.C18H22N8O2S
Mol. Mass.414.485
SMILESCOc1nsc(NC(=O)N2C[C@@H]3C[C@@H](C[C@@H]3C2)N(C)c2ncnc3[nH]ccc23)n1