Reaction Details
TargetTyrosine-protein kinase JAK1
LigandBDBM202503
Substrate/Competitorn/a
Meas. Tech.JAK1 Kinase Assay
pH7.3±n/a
Temperature298.15±n/a K
IC50 1.00±n/a nM
Commentsextracted
Citation Zhang, XDong, QLiu, BZhu, YLi, XLan, J Pyrrole six-membered heteroaryl ring derivative, preparation method thereof, and medicinal uses thereof US Patent US9527851 Publication Date 12/27/2016
 
Tyrosine-protein kinase JAK1
Name:Tyrosine-protein kinase JAK1
Type:Protein
Mol. Mass.:133293.73
Organism:Homo sapiens (Human)
Description:P23458
Residue:1154
BDBM202503
NameBDBM202503
Synonyms:US9527851, example 121
TypeSmall organic molecule
Emp. Form.C19H23N7O2S
Mol. Mass.413.497
SMILESCCc1nsc(OC(=O)N2C[C@@H]3C[C@H](C[C@@H]3C2)N(C)c2ncnc3[nH]ccc23)n1