Reaction Details
TargetTyrosine-protein kinase JAK2
LigandBDBM260473
Substrate/Competitorn/a
Meas. Tech.In vitro kinase assay
pH7.3±n/a
Temperature298.15±n/a K
IC50 7.00±n/a nM
Commentsextracted
Citation Zhang, XDong, QLiu, BZhu, YLi, XLan, J Pyrrole six-membered heteroaryl ring derivative, preparation method thereof, and medicinal uses thereof US Patent US9527851 Publication Date 12/27/2016
 
Tyrosine-protein kinase JAK2
Name:Tyrosine-protein kinase JAK2
Type:Protein
Mol. Mass.:130684.68
Organism:Homo sapiens (Human)
Description:O60674
Residue:1132
BDBM260473
NameBDBM260473
Synonyms:US10428074, Example 38 US9527851, example 38
TypeSmall organic molecule
Emp. Form.C19H24N8O2S
Mol. Mass.428.511
SMILESCOc1nsc(NC(=O)N2CC[C@H]3CC(C[C@H]3C2)N(C)c2ncnc3[nH]ccc23)n1