Reaction Details
TargetPhosphatidylinositol 4,5-bisphosphate 3-kinase catalytic subunit gamma isoform
LigandBDBM338854
Substrate/Competitorn/a
Meas. Tech.Inhibition Assay
IC50 55±n/a nM
Citation Castro, ACEvans, CAJanardanannair, SLescarbeau, ALiu, TTremblay, MR Heterocyclic compounds and uses thereof US Patent US9751888 Publication Date 9/5/2017
 
Phosphatidylinositol 4,5-bisphosphate 3-kinase catalytic subunit gamma isoform
Name:Phosphatidylinositol 4,5-bisphosphate 3-kinase catalytic subunit gamma isoform
Type:Enzyme Subunit
Mol. Mass.:126470.30
Organism:Homo sapiens (Human)
Description:P48736
Residue:1102
BDBM338854
NameBDBM338854
Synonyms:US9751888, Compound 19
TypeSmall organic molecule
Emp. Form.C20H20ClN7O4S
Mol. Mass.489.935
SMILESC[C@H](NC(=O)c1c(N)nn2cccnc12)c1cc2cccc(Cl)c2c(=O)n1CCS(N)(=O)=O