Reaction Details
TargetPhosphatidylinositol 3-kinase regulatory subunit beta
LigandBDBM338879
Substrate/Competitorn/a
Meas. Tech.Inhibition Assay
IC50 5.5±n/a nM
Citation Castro, ACEvans, CAJanardanannair, SLescarbeau, ALiu, TTremblay, MR Heterocyclic compounds and uses thereof US Patent US9751888 Publication Date 9/5/2017
 
Phosphatidylinositol 3-kinase regulatory subunit beta
Name:Phosphatidylinositol 3-kinase regulatory subunit beta
Type:Enzyme Subunit
Mol. Mass.:81542.75
Organism:Homo sapiens (Human)
Description:O00459
Residue:728
BDBM338879
NameBDBM338879
Synonyms:US9751888, Compound 70
TypeSmall organic molecule
Emp. Form.C24H19ClN6O3
Mol. Mass.474.899
SMILESC[C@H](NC(=O)c1c(N)nn2cccnc12)c1cc2cccc(Cl)c2c(=O)n1-c1ccc(O)cc1