Reaction Details
TargetP2Y purinoceptor 1
LigandBDBM260841
Substrate/Competitorn/a
Meas. Tech.Scintillation Proximity Assay (SPA)
pH7.4±n/a
Temperature298.15±n/a K
Ki 3.10±n/a nM
Commentsextracted
Citation LHeureux, A 7-hydroxy-indolinyl antagonists of P2Y1 receptor US Patent US9540323 Publication Date 1/10/2017
 
P2Y purinoceptor 1
Name:P2Y purinoceptor 1
Type:Enzyme
Mol. Mass.:42090.25
Organism:Homo sapiens (Human)
Description:P47900
Residue:373
BDBM260841
NameBDBM260841
Synonyms:US9540323, 27 | US9540323, example 27
TypeSmall organic molecule
Emp. Form.C27H30FN3O2
Mol. Mass.447.5444
SMILESCCc1ccc(NC(=O)Nc2ccccc2N2CC(CC)(CC)c3c2c(O)ccc3F)cc1