Reaction Details
TargetP2Y purinoceptor 1
LigandBDBM260934
Substrate/Competitorn/a
Meas. Tech.Scintillation Proximity Assay (SPA)
pH7.4±n/a
Temperature298.15±n/a K
Ki 4.10±n/a nM
Commentsextracted
Citation LHeureux, A 7-hydroxy-indolinyl antagonists of P2Y1 receptor US Patent US9540323 Publication Date 1/10/2017
 
P2Y purinoceptor 1
Name:P2Y purinoceptor 1
Type:Enzyme
Mol. Mass.:42090.25
Organism:Homo sapiens (Human)
Description:P47900
Residue:373
BDBM260934
NameBDBM260934
Synonyms:US9540323, 126 | US9540323, example 126
TypeSmall organic molecule
Emp. Form.C31H30F3N5O3
Mol. Mass.577.5968
SMILESCC(C)c1cnc(nc1)-c1ccc(O)c2N(CC(C)(C)c12)c1ccccc1NC(=O)Nc1ccc(OC(F)(F)F)cc1