Reaction Details
TargetP2Y purinoceptor 1
LigandBDBM50045629
Substrate/Competitorn/a
Meas. Tech.Scintillation Proximity Assay (SPA)
pH7.4±n/a
Temperature298.15±n/a K
Ki 6.70±n/a nM
Commentsextracted
Citation LHeureux, A 7-hydroxy-indolinyl antagonists of P2Y1 receptor US Patent US9540323 Publication Date 1/10/2017
 
P2Y purinoceptor 1
Name:P2Y purinoceptor 1
Type:Enzyme
Mol. Mass.:42090.25
Organism:Homo sapiens (Human)
Description:P47900
Residue:373
BDBM50045629
NameBDBM50045629
Synonyms:CHEMBL3314309 US9540323, example 194
TypeSmall organic molecule
Emp. Form.C30H24F5N3O3
Mol. Mass.569.5219
SMILESCC1(C)CN(c2c1c(c(F)cc2O)-c1ccc(F)cc1)c1ccccc1NC(=O)Nc1ccc(OC(F)(F)F)cc1