Reaction Details
TargetP2Y purinoceptor 1
LigandBDBM50045612
Substrate/Competitorn/a
Meas. Tech.Scintillation Proximity Assay (SPA)
pH7.4±n/a
Temperature298.15±n/a K
Ki 9.00±n/a nM
Commentsextracted
Citation LHeureux, A 7-hydroxy-indolinyl antagonists of P2Y1 receptor US Patent US9540323 Publication Date 1/10/2017
 
P2Y purinoceptor 1
Name:P2Y purinoceptor 1
Type:Enzyme
Mol. Mass.:42090.25
Organism:Homo sapiens (Human)
Description:P47900
Residue:373
BDBM50045612
NameBDBM50045612
Synonyms:CHEMBL3314295 US9540323, example 195
TypeSmall organic molecule
Emp. Form.C30H26F3N3O3
Mol. Mass.533.5409
SMILESCC1(C)CN(c2c1c(ccc2O)-c1ccccc1)c1ccccc1NC(=O)Nc1ccc(OC(F)(F)F)cc1