Reaction Details
TargetP2Y purinoceptor 1
LigandBDBM50045613
Substrate/Competitorn/a
Meas. Tech.Scintillation Proximity Assay (SPA)
pH7.4±n/a
Temperature298.15±n/a K
Ki 8.70±n/a nM
Commentsextracted
Citation LHeureux, A 7-hydroxy-indolinyl antagonists of P2Y1 receptor US Patent US9540323 Publication Date 1/10/2017
 
P2Y purinoceptor 1
Name:P2Y purinoceptor 1
Type:Enzyme
Mol. Mass.:42090.25
Organism:Homo sapiens (Human)
Description:P47900
Residue:373
BDBM50045613
NameBDBM50045613
Synonyms:CHEMBL3314296 US9540323, example 207
TypeSmall organic molecule
Emp. Form.C30H25F4N3O3
Mol. Mass.551.5314
SMILESCC1(C)CN(c2c1c(ccc2O)-c1ccccc1F)c1ccccc1NC(=O)Nc1ccc(OC(F)(F)F)cc1