Reaction Details
TargetAmine oxidase [flavin-containing] A
LigandBDBM339422
Substrate/Competitorn/a
Meas. Tech.Monoamine Oxidase Assays
Ki 20500±n/a nM
Citation Muñoz, AOCastro-Palomino Laria, JFyfe, MC Lysine specific demethylase-1 inhibitors and their use US Patent US10202330 Publication Date 2/12/2019
 
Amine oxidase [flavin-containing] A
Name:Amine oxidase [flavin-containing] A
Type:Protein
Mol. Mass.:59689.53
Organism:Homo sapiens (Human)
Description:P21397
Residue:527
BDBM339422
NameBDBM339422
Synonyms:US10202330, Example 13
TypeSmall organic molecule
Emp. Form.C18H27N
Mol. Mass.257.4137
SMILESC(CN[C@H]1CC1c1ccccc1)CC1CCCCC1