Reaction Details
TargetAmine oxidase [flavin-containing] A
LigandBDBM339424
Substrate/Competitorn/a
Meas. Tech.Monoamine Oxidase Assays
Ki 20500±n/a nM
Citation Muñoz, AOCastro-Palomino Laria, JFyfe, MC Lysine specific demethylase-1 inhibitors and their use US Patent US10202330 Publication Date 2/12/2019
 
Amine oxidase [flavin-containing] A
Name:Amine oxidase [flavin-containing] A
Type:Protein
Mol. Mass.:59689.53
Organism:Homo sapiens (Human)
Description:P21397
Residue:527
BDBM339424
NameBDBM339424
Synonyms:US10202330, Example 15
TypeSmall organic molecule
Emp. Form.C24H30BrNO
Mol. Mass.428.405
SMILESBrc1cccc(COc2ccc(cc2)C2C[C@@H]2NCCC2CCCCC2)c1