Reaction Details
TargetFibroblast growth factor receptor 1
LigandBDBM339801
Substrate/Competitorn/a
Meas. Tech.FGFR1 (Enzymatic Assay)
IC50 1.26±n/a nM
Citation Angibaud, PRObringer, MMarin, JJJeanty, M Naphthyridine derivative compounds US Patent US9757364 Publication Date 9/12/2017
 
Fibroblast growth factor receptor 1
Name:Fibroblast growth factor receptor 1
Type:Receptor
Mol. Mass.:91861.70
Organism:Homo sapiens (Human)
Description:P11362
Residue:822
BDBM339801
NameBDBM339801
Synonyms:US9757364, Compound 4
TypeSmall organic molecule
Emp. Form.C25H30N6O2
Mol. Mass.446.5447
SMILESCOc1cc(OC)cc(c1)N(CCNC(C)C)c1ccc2ncc(cc2n1)-c1cnn(C)c1