Reaction Details
TargetFibroblast growth factor receptor 2
LigandBDBM339801
Substrate/Competitorn/a
Meas. Tech.FGFR2 (Enzymatic Assay)
IC50 3.98±n/a nM
Citation Angibaud, PRObringer, MMarin, JJJeanty, M Naphthyridine derivative compounds US Patent US9757364 Publication Date 9/12/2017
 
Fibroblast growth factor receptor 2
Name:Fibroblast growth factor receptor 2
Type:Enzyme
Mol. Mass.:92015.45
Organism:Homo sapiens (Human)
Description:P21802
Residue:821
BDBM339801
NameBDBM339801
Synonyms:US9757364, Compound 4
TypeSmall organic molecule
Emp. Form.C25H30N6O2
Mol. Mass.446.5447
SMILESCOc1cc(OC)cc(c1)N(CCNC(C)C)c1ccc2ncc(cc2n1)-c1cnn(C)c1