Reaction Details
TargetFibroblast growth factor receptor 3
LigandBDBM339805
Substrate/Competitorn/a
Meas. Tech.FGFR3 (Enzymatic Assay)
IC50 2.00±n/a nM
Citation Angibaud, PRObringer, MMarin, JJJeanty, M Naphthyridine derivative compounds US Patent US9757364 Publication Date 9/12/2017
 
Fibroblast growth factor receptor 3
Name:Fibroblast growth factor receptor 3
Type:Protein
Mol. Mass.:87699.57
Organism:Homo sapiens (Human)
Description:P22607
Residue:806
BDBM339805
NameBDBM339805
Synonyms:US9757364, Compound 7
TypeSmall organic molecule
Emp. Form.C26H28N8O4S
Mol. Mass.548.617
SMILESCOc1cc(OC)cc(c1)N(Cc1nccn1S(=O)(=O)N(C)C)c1ccc2ncc(cc2n1)-c1cnn(C)c1