Reaction Details
TargetVascular endothelial growth factor receptor 2
LigandBDBM339805
Substrate/Competitorn/a
Meas. Tech.KDR (VEGFR2) (Enzymatic Assay)
IC50 50.1±n/a nM
Citation Angibaud, PRObringer, MMarin, JJJeanty, M Naphthyridine derivative compounds US Patent US9757364 Publication Date 9/12/2017
 
Vascular endothelial growth factor receptor 2
Name:Vascular endothelial growth factor receptor 2
Type:Receptor Tyrosine Kinase
Mol. Mass.:151510.97
Organism:Homo sapiens (Human)
Description:P35968
Residue:1356
BDBM339805
NameBDBM339805
Synonyms:US9757364, Compound 7
TypeSmall organic molecule
Emp. Form.C26H28N8O4S
Mol. Mass.548.617
SMILESCOc1cc(OC)cc(c1)N(Cc1nccn1S(=O)(=O)N(C)C)c1ccc2ncc(cc2n1)-c1cnn(C)c1