Reaction Details
TargetFibroblast growth factor receptor 4
LigandBDBM339807
Substrate/Competitorn/a
Meas. Tech.FGFR4 (Enzymatic Assay)
IC50 2.00±n/a nM
Citation Angibaud, PRObringer, MMarin, JJJeanty, M Naphthyridine derivative compounds US Patent US9757364 Publication Date 9/12/2017
 
Fibroblast growth factor receptor 4
Name:Fibroblast growth factor receptor 4
Type:Protein
Mol. Mass.:87957.45
Organism:Homo sapiens (Human)
Description:P22455
Residue:802
BDBM339807
NameBDBM339807
Synonyms:US9757364, Compound 11
TypeSmall organic molecule
Emp. Form.C23H24ClN5O3
Mol. Mass.453.921
SMILESCOc1cc(OC)cc(c1)N(CCCO)c1ccc2ncc(-c3cnn(C)c3)c(Cl)c2n1