Reaction Details
TargetFibroblast growth factor receptor 4
LigandBDBM339823
Substrate/Competitorn/a
Meas. Tech.FGFR4 (Enzymatic Assay)
IC50 1.02±n/a nM
Citation Angibaud, PRObringer, MMarin, JJJeanty, M Naphthyridine derivative compounds US Patent US9757364 Publication Date 9/12/2017
 
Fibroblast growth factor receptor 4
Name:Fibroblast growth factor receptor 4
Type:Protein
Mol. Mass.:87957.45
Organism:Homo sapiens (Human)
Description:P22455
Residue:802
BDBM339823
NameBDBM339823
Synonyms:US9757364, Compound 16
TypeSmall organic molecule
Emp. Form.C24H22ClN7O2
Mol. Mass.475.93
SMILESCOc1cc(OC)cc(c1)N(Cc1ncc[nH]1)c1ccc2ncc(-c3cnn(C)c3)c(Cl)c2n1