Reaction Details
TargetFibroblast growth factor receptor 2
LigandBDBM339828
Substrate/Competitorn/a
Meas. Tech.FGFR2 (Enzymatic Assay)
IC50 3.63±n/a nM
Citation Angibaud, PRObringer, MMarin, JJJeanty, M Naphthyridine derivative compounds US Patent US9757364 Publication Date 9/12/2017
 
Fibroblast growth factor receptor 2
Name:Fibroblast growth factor receptor 2
Type:Enzyme
Mol. Mass.:92015.45
Organism:Homo sapiens (Human)
Description:P21802
Residue:821
BDBM339828
NameBDBM339828
Synonyms:US9757364, Compound 30
TypeSmall organic molecule
Emp. Form.C23H25FN6O2
Mol. Mass.436.482
SMILESCNCCN(c1ccc2ncc(cc2n1)-c1cnn(C)c1)c1cc(OC)cc(OC)c1F