Reaction Details
TargetFibroblast growth factor receptor 1
LigandBDBM339836
Substrate/Competitorn/a
Meas. Tech.FGFR1 (Enzymatic Assay)
IC50 1.29±n/a nM
Citation Angibaud, PRObringer, MMarin, JJJeanty, M Naphthyridine derivative compounds US Patent US9757364 Publication Date 9/12/2017
 
Fibroblast growth factor receptor 1
Name:Fibroblast growth factor receptor 1
Type:Receptor
Mol. Mass.:91861.70
Organism:Homo sapiens (Human)
Description:P11362
Residue:822
BDBM339836
NameBDBM339836
Synonyms:US9757364, Compound 34
TypeSmall organic molecule
Emp. Form.C24H21Cl2N7O2
Mol. Mass.510.375
SMILESCOc1cc(OC)c(Cl)c(N(Cc2ncc[nH]2)c2ccc3ncc(cc3n2)-c2cnn(C)c2)c1Cl